BDBM117056 US8664236, A35::US9238651, A35
SMILES Cn1cc(cn1)-c1cnc2[nH]cc(-c3cc(nc(N)n3)N(CCC(N)=O)c3ccccc3)c2c1
InChI Key InChIKey=MKBVASLXGYMWKZ-UHFFFAOYSA-N
Data  3 IC50
  Tab Delimited (TSV)   2D SDfile   Computed 3D by Vconf -m prep SDfile
Find this compound or compounds like it in BindingDB:
Activity Spreadsheet -- Enzyme Inhibition Constant Data from BindingDB
Found 3 hits for monomerid = 117056
Target3-phosphoinositide-dependent protein kinase 1(Homo sapiens (Human))
Merck Patent
US Patent
LigandPNGBDBM117056(US8664236, A35 | US9238651, A35)
Affinity DataIC50:  17nM. Assay description: The compound inhibits the target protein in the enzymatic PDK1 inhibition assay.
In DepthDetails US Patent
Target3-phosphoinositide-dependent protein kinase 1(Homo sapiens (Human))
Merck Patent
US Patent
LigandPNGBDBM117056(US8664236, A35 | US9238651, A35)
Affinity DataIC50:  2.30E+4nMpH: 8.0 T: 2°C. Assay description: The cellular assay for the determination of the PDK1 kinase activity is carried out as a Luminex assay in the 96-well format. PC3 cells are sown at...
In DepthDetails US Patent
Target3-phosphoinositide-dependent protein kinase 1(Homo sapiens (Human))
Merck Patent
US Patent
LigandPNGBDBM117056(US8664236, A35 | US9238651, A35)
Affinity DataIC50:  17nMT: 2°C. Assay description: The experimental batches are carried out in a flashplate system with 384 wells/microtitration plate.In each case, the PDK1 sample His6-PDK1(Δ1-...
In DepthDetails US Patent