BDBM117668 US8653087, III-348
SMILES Cc1ccc(cc1Nc1ncnc2cnc(NC3CCOC3)nc12)C(=O)Nc1cc(nn1C)C(C)(C)C
InChI Key InChIKey=TVPZKDYICOGWCS-UHFFFAOYSA-N
Data  1 IC50
  Tab Delimited (TSV)   2D SDfile   Computed 3D by Vconf -m prep SDfile
Find this compound or compounds like it in BindingDB:
Activity Spreadsheet -- Enzyme Inhibition Constant Data from BindingDB
Found 1 hit for monomerid = 117668
TargetSerine/threonine-protein kinase B-raf [V600E](Homo sapiens (Human))
Boehringer Ingelheim International
US Patent
LigandPNGBDBM117668(US8653087, III-348)
Affinity DataIC50: <1nMpH: 7.5Assay Description:The final concentration of DMSO is 5%. 10 μL of the B-Raf (V600E)-kinase solution are pipetted in (containing 0.5 ng B-Raf (V600E)-kinase in 20 ...
In DepthDetails US Patent