BDBM117955 US8653087, IV-27
SMILES CCN1CCN(CC1)c1ncc2ncnc(Nc3cc(NC(=O)c4cccc(c4)C(C)(C)C#N)ccc3C)c2n1
InChI Key InChIKey=MRXJYVFMJBNCAF-UHFFFAOYSA-N
Data  1 IC50
  Tab Delimited (TSV)   2D SDfile   Computed 3D by Vconf -m prep SDfile
Find this compound or compounds like it in BindingDB:
Activity Spreadsheet -- Enzyme Inhibition Constant Data from BindingDB
Found 1 hit for monomerid = 117955
TargetSerine/threonine-protein kinase B-raf [V600E](Homo sapiens (Human))
Boehringer Ingelheim International
US Patent
LigandPNGBDBM117955(US8653087, IV-27)
Affinity DataIC50:  1nMpH: 7.5Assay Description:The final concentration of DMSO is 5%. 10 μL of the B-Raf (V600E)-kinase solution are pipetted in (containing 0.5 ng B-Raf (V600E)-kinase in 20 ...
In DepthDetails US Patent