BDBM118091 US8637558, 129
SMILES Oc1[nH]c(=O)sc1Cc1ccc(OCc2ccc(cc2)-c2ccccc2)cc1
InChI Key InChIKey=FFJDSOPHQSPQKY-UHFFFAOYSA-N
Data  1 IC50
  Tab Delimited (TSV)   2D SDfile   Computed 3D by Vconf -m prep SDfile
Find this compound or compounds like it in BindingDB:
Activity Spreadsheet -- Enzyme Inhibition Constant Data from BindingDB
Found 1 hit for monomerid = 118091
Target15-hydroxyprostaglandin dehydrogenase [NAD(+)](Homo sapiens (Human))
Industry-Academic Cooperation Foundation, Chosun University
US Patent
LigandPNGBDBM118091(US8637558, 129)
Affinity DataIC50:  1.08E+3nMpH: 7.5Assay Description:Experimental was performed by measuring the formation of NADH at 340 nm with a fluorescence spectrophotometer. Specifically, 2 ml (in total) of the s...
In DepthDetails US Patent