BDBM118097 US8664219, I-9
SMILES Cc1cc(Nc2n[nH]c3ncc(F)cc23)nc(n1)C1CCCC1
InChI Key InChIKey=VJTITFHQYIFDAU-UHFFFAOYSA-N
Data  2 IC50
  Tab Delimited (TSV)   2D SDfile   Computed 3D by Vconf -m prep SDfile
Find this compound or compounds like it in BindingDB:
Activity Spreadsheet -- Enzyme Inhibition Constant Data from BindingDB
Found 2 hits for monomerid = 118097
TargetGlycogen synthase kinase-3 beta(Homo sapiens (Human))
Vertex Pharmaceuticals
US Patent
LigandPNGBDBM118097(US8664219, I-9)
Affinity DataIC50:  48nM. Assay description: Compounds are screened for their ability to inhibit the phosphorylation of tyrosine (TYR) residues through the use of western blotting of Jurkat cell...
In DepthDetails US Patent
TargetGlycogen synthase kinase-3 alpha(Homo sapiens (Human))
Vertex Pharmaceuticals
US Patent
LigandPNGBDBM118097(US8664219, I-9)
Affinity DataIC50:  2nM. Assay description: Compounds are screened for their ability to inhibit the phosphorylation of tyrosine (TYR) residues through the use of western blotting of Jurkat cell...
In DepthDetails US Patent