BDBM118177 US8653125, Ia-32
SMILES CC(C)n1c2ccc(NC(=O)[C@@H]3CC[C@@H](CC3)NC(=O)c3ccon3)cc2oc1=O
InChI Key InChIKey=PPQMXAXIRZKXHE-OKILXGFUSA-N
Data  1 IC50
  Tab Delimited (TSV)   2D SDfile   Computed 3D by Vconf -m prep SDfile
Find this compound or compounds like it in BindingDB:
Activity Spreadsheet -- Enzyme Inhibition Constant Data from BindingDB
Found 1 hit for monomerid = 118177
TargetNeuropeptide Y receptor type 5(Mus musculus (Mouse))
Shionogi
US Patent
LigandPNGBDBM118177(US8653125, Ia-32)
Affinity DataIC50:  3.30nMpH: 7.4 T: 2°C. Assay description: cDNA sequence encoding mouse NPY Y5 receptor (Biochem. Biophys. Acta 1328: 83-89, 1997) was cloned in the expression vector (pME18S, Takebe et al. Mo...
In DepthDetails US Patent