BDBM118182 US8653125, Ib-1
SMILES Fc1cccc(N[C@H]2CC[C@H](CC2)C(=O)Nc2ccn(n2)-c2ccccc2F)n1
InChI Key InChIKey=BTAFTIZFQLUJSL-GASCZTMLSA-N
Data  1 IC50
  Tab Delimited (TSV)   2D SDfile   Computed 3D by Vconf -m prep SDfile
Find this compound or compounds like it in BindingDB:
Activity Spreadsheet -- Enzyme Inhibition Constant Data from BindingDB
Found 1 hit for monomerid = 118182
TargetNeuropeptide Y receptor type 5(Mus musculus (Mouse))
Shionogi
US Patent
LigandPNGBDBM118182(US8653125, Ib-1)
Affinity DataIC50:  2.90nMpH: 7.4 T: 2°C. Assay description: cDNA sequence encoding mouse NPY Y5 receptor (Biochem. Biophys. Acta 1328: 83-89, 1997) was cloned in the expression vector (pME18S, Takebe et al. Mo...
Ligand InfoPC cidPC sid
In DepthDetails US Patent