BDBM118328 US8653111, 7
SMILES Cc1ccnc(c1)-n1[nH]cc(-n2ccnn2)c1=O
InChI Key InChIKey=OCFRILXPXYIVOK-UHFFFAOYSA-N
Data  1 IC50
  Tab Delimited (TSV)   2D SDfile   Computed 3D by Vconf -m prep SDfile
Find this compound or compounds like it in BindingDB:
Activity Spreadsheet -- Enzyme Inhibition Constant Data from BindingDB
Found 1 hit for monomerid = 118328
TargetProlyl hydroxylase EGLN2(Homo sapiens (Human))
Bayer Intellectual Property
US Patent
LigandPNGBDBM118328(US8653111, 7)
Affinity DataIC50:  340nM. Assay description: Hydroxylated HIF bonds specifically to the von Hippel-Lindau protein-elongin B-elongin C complex (VBC complex). This interaction occurs only if HIF i...
In DepthDetails US Patent