BDBM118587 US11059828, Example 240::US11667644, Example 240::US8653263, 240::US9586962, Example 240::USRE48841, Example 240
SMILES Cc1nc(nc(C)c1C)N1CC2CN(CC2C1)C(=O)c1cccc(F)c1-n1nccn1
InChI Key InChIKey=KDHLPRRQACKDAW-UHFFFAOYSA-N
Data  10 KI
  Tab Delimited (TSV)   2D SDfile   Computed 3D by Vconf -m prep SDfile
Find this compound or compounds like it in BindingDB:
Activity Spreadsheet -- Enzyme Inhibition Constant Data from BindingDB
Found 10 hits for monomerid = 118587
TargetOrexin receptor type 2(Homo sapiens (Human))
Janssen Pharmaceutica
US Patent
LigandPNGBDBM118587(US11059828, Example 240 | US11667644, Example 240 ...)
Affinity DataKi:  7nM. Assay description: The in vitro affinity of the compounds for the human orexin-1 and orexin-2 receptors was determined by competitive radioligand binding using [3H]SB S...
In DepthDetails US Patent
TargetOrexin receptor type 2(Homo sapiens (Human))
Janssen Pharmaceutica
US Patent
LigandPNGBDBM118587(US11059828, Example 240 | US11667644, Example 240 ...)
Affinity DataKi:  7nM. Assay description: HEK293 stably expressing human orexin-2 receptor (Genebank accession number NM_001526) were grown to confluency in DMEM/F12 (Gibco, Cat #11039), in D...
In DepthDetails US Patent
TargetOrexin receptor type 2(Homo sapiens (Human))
Janssen Pharmaceutica
US Patent
LigandPNGBDBM118587(US11059828, Example 240 | US11667644, Example 240 ...)
Affinity DataKi:  7nM. Assay description: HEK293 stably expressing human orexin-2 receptor (Genebank accession number NM_001526) were grown to confluency in DMEM/F12 (Gibco, Cat #11039), in D...
In DepthDetails US Patent
TargetOrexin receptor type 2(Homo sapiens (Human))
Janssen Pharmaceutica
US Patent
LigandPNGBDBM118587(US11059828, Example 240 | US11667644, Example 240 ...)
Affinity DataKi:  7nM. Assay description: HEK293 stably expressing human orexin-2 receptor (Genebank accession number NM_001526) were grown to confluency in DMEM/F12 (Gibco, Cat #11039), in D...
In DepthDetails US Patent
TargetOrexin/Hypocretin receptor type 1(Homo sapiens (Human))
Janssen Pharmaceutica
US Patent
LigandPNGBDBM118587(US11059828, Example 240 | US11667644, Example 240 ...)
Affinity DataKi:  7nM ΔG°:  -11.1kcal/moleT: 2°C. Assay description: Chinese ovary cells (CHO) stably expressing human orexin 1 receptor (Genebank accession number NM_001526) were grown to confluency in DMEM/F12 (Gibco...
In DepthDetails US Patent
TargetOrexin/Hypocretin receptor type 1(Homo sapiens (Human))
Janssen Pharmaceutica
US Patent
LigandPNGBDBM118587(US11059828, Example 240 | US11667644, Example 240 ...)
Affinity DataKi:  460nM. Assay description: Chinese ovary cells (CHO) stably expressing human orexin 1 receptor (Genebank accession number NM_001526) were grown to confluency in DMEM/F12 (Gibco...
In DepthDetails US Patent
TargetOrexin/Hypocretin receptor type 1(Homo sapiens (Human))
Janssen Pharmaceutica
US Patent
LigandPNGBDBM118587(US11059828, Example 240 | US11667644, Example 240 ...)
Affinity DataKi:  460nM. Assay description: Chinese ovary cells (CHO) stably expressing human orexin 1 receptor (Genebank accession number NM_001526) were grown to confluency in DMEM/F12 (Gibco...
In DepthDetails US Patent
TargetOrexin receptor type 2(Homo sapiens (Human))
Janssen Pharmaceutica
US Patent
LigandPNGBDBM118587(US11059828, Example 240 | US11667644, Example 240 ...)
Affinity DataKi:  460nM ΔG°:  -8.64kcal/moleT: 2°C. Assay description: HEK293 stably expressing human orexin-2 receptor (Genebank accession number NM_001526) were grown to confluency in DMEM/F12 (Gibco, Cat #11039), in D...
In DepthDetails US Patent
TargetOrexin/Hypocretin receptor type 1(Homo sapiens (Human))
Janssen Pharmaceutica
US Patent
LigandPNGBDBM118587(US11059828, Example 240 | US11667644, Example 240 ...)
Affinity DataKi:  460nM. Assay description: Chinese ovary cells (CHO) stably expressing human orexin 1 receptor (Genebank accession number NM_001526) were grown to confluency in DMEM/F12 (Gibco...
In DepthDetails US Patent
TargetOrexin/Hypocretin receptor type 1(Homo sapiens (Human))
Janssen Pharmaceutica
US Patent
LigandPNGBDBM118587(US11059828, Example 240 | US11667644, Example 240 ...)
Affinity DataKi:  460nM. Assay description: The in vitro affinity of the compounds for the human orexin-1 and orexin-2 receptors was determined by competitive radioligand binding using [3H]SB S...
In DepthDetails US Patent