BDBM11899 (2S)-2-amino-N-[(1S)-1-cyanoethyl]-3,3-dimethylbutanamide::seco-proline-based inhibitor 15
SMILES [H][C@@](N)(C(=O)N[C@@H](C)C#N)C(C)(C)C
InChI Key InChIKey=YHUWLCRDWQAQJY-NKWVEPMBSA-N
Data  1 KI
  Tab Delimited (TSV)   2D SDfile   Computed 3D by Vconf -m prep SDfile
Find this compound or compounds like it in BindingDB:
Activity Spreadsheet -- Enzyme Inhibition Constant Data from BindingDB
Found 1 hit for monomerid = 11899
TargetDipeptidyl peptidase 4(Homo sapiens (Human))
Bristol-Myers Squibb Pharmaceutical Research Institute
LigandPNGBDBM11899((2S)-2-amino-N-[(1S)-1-cyanoethyl]-3,3-dimethylbut...)
Affinity DataKi:  4.42E+3nM ΔG°:  -7.23kcal/molepH: 7.4 T: 2°C. Assay description: Inhibition of human DPP-IV activity was measured under steady-state conditions by following the absorbance increase at 405 nm upon the substrate clea...
In DepthDetails ArticlePubMed