BDBM119022 US8674100, 34::US9221797, 34
SMILES CSc1ncc([nH]1)C(=O)Nc1ccc(CCN2CCOCC2)cc1C1=CCCCC1
InChI Key InChIKey=JWVUAGWYQMBDFQ-UHFFFAOYSA-N
Data  2 IC50
  Tab Delimited (TSV)   2D SDfile   Computed 3D by Vconf -m prep SDfile
Find this compound or compounds like it in BindingDB:
Activity Spreadsheet -- Enzyme Inhibition Constant Data from BindingDB
Found 2 hits for monomerid = 119022
TargetMacrophage colony-stimulating factor 1 receptor [555-568](Homo sapiens (Human))
Janssen Pharmaceutica
US Patent
LigandPNGBDBM119022(US8674100, 34 | US9221797, 34)
Affinity DataIC50:  373nMpH: 7.5Assay Description:A fluorescence polarization competition immunoassay was used to measure compound inhibition of CSF-1R phosphorylation of tyrosine on a synthetic CS...
In DepthDetails US Patent
TargetMacrophage colony-stimulating factor 1 receptor(Mus musculus (Mouse))
Janssen Pharmaceutica
US Patent
LigandPNGBDBM119022(US8674100, 34 | US9221797, 34)
Affinity DataIC50:  373nMpH: 7.5Assay Description:A fluorescence polarization competition immunoassay was used to measure compound inhibition of CSF-1R phosphorylation of tyrosine on a synthetic CSF-...
In DepthDetails US Patent