BDBM119035 US8674100, 48
SMILES OC(=O)C=Cc1ccc(NC(=O)c2ncc([nH]2)C#N)c(c1)C1=CCCCC1
InChI Key InChIKey=WEVPNKITDWKLNV-VQHVLOKHSA-N
Data  2 IC50
  Tab Delimited (TSV)   2D SDfile   Computed 3D by Vconf -m prep SDfile
Find this compound or compounds like it in BindingDB:
Activity Spreadsheet -- Enzyme Inhibition Constant Data from BindingDB
Found 2 hits for monomerid = 119035
TargetMacrophage colony-stimulating factor 1 receptor(Mus musculus (Mouse))
Janssen Pharmaceutica
US Patent
LigandPNGBDBM119035(US8674100, 48)
Affinity DataIC50:  5.30nMpH: 7.5Assay Description:A fluorescence polarization competition immunoassay was used to measure compound inhibition of CSF-1R phosphorylation of tyrosine on a synthetic CSF-...
In DepthDetails US Patent
TargetMacrophage colony-stimulating factor 1 receptor(Mus musculus (Mouse))
Janssen Pharmaceutica
US Patent
LigandPNGBDBM119035(US8674100, 48)
Affinity DataIC50:  3.90nMpH: 7.5Assay Description:A fluorescence polarization competition immunoassay was used to measure compound inhibition of CSF-1R phosphorylation of tyrosine on a synthetic CSF-...
In DepthDetails US Patent