BDBM119144 US8673950, 11
SMILES NC1=N[C@@H](CCc2ccc(Nc3ccc(cn3)C(F)(F)F)cc2)CO1
InChI Key InChIKey=JMRWXUNCUZBXHM-AWEZNQCLSA-N
Data  2 KI
  Tab Delimited (TSV)   2D SDfile   Computed 3D by Vconf -m prep SDfile
Find this compound or compounds like it in BindingDB:
Activity Spreadsheet -- Enzyme Inhibition Constant Data from BindingDB
Found 2 hits for monomerid = 119144
TargetTrace amine-associated receptor 1(Mus musculus (Mouse))
Hoffmann-La Roche
US Patent
LigandPNGBDBM119144(US8673950, 11)
Affinity DataKi:  0.200nM. Assay description: The TAAR1 radioligand 3[H]-(S)-4-[(ethyl-phenyl-amino)-methyl]-4,5-dihydro-oxazol-2-ylamine (described in WO 2008/098857) was used at a concentration...
In DepthDetails US Patent
TargetTrace amine-associated receptor 1(Rattus norvegicus (Rat))
Hoffmann-La Roche
US Patent
LigandPNGBDBM119144(US8673950, 11)
Affinity DataKi:  0.400nM. Assay description: The TAAR1 radioligand 3[H]-(S)-4-[(ethyl-phenyl-amino)-methyl]-4,5-dihydro-oxazol-2-ylamine (described in WO 2008/098857) was used at a concentration...
In DepthDetails US Patent