BDBM11921 (1S,3S,5S)-2-{[(2S,3S)-3-ethylpyrrolidin-2-yl]carbonyl}-2-azabicyclo[3.1.0]hexane-3-carbonitrile::substituted diprolyl nitrile 14
SMILES CC[C@H]1CCN[C@@H]1C(=O)N1[C@H]2C[C@H]2C[C@H]1C#N
InChI Key InChIKey=DNKHDIRQNJCPRL-OSUNSFLBSA-N
Data  1 KI
  Tab Delimited (TSV)   2D SDfile   Computed 3D by Vconf -m prep SDfile
Find this compound or compounds like it in BindingDB:
Activity Spreadsheet -- Enzyme Inhibition Constant Data from BindingDB
Found 1 hit for monomerid = 11921
TargetDipeptidyl peptidase 4(Sus scrofa (pig))
Bristol-Myers Squibb Pharmaceutical Research Institute
LigandPNGBDBM11921((1S,3S,5S)-2-{[(2S,3S)-3-ethylpyrrolidin-2-yl]carb...)
Affinity DataKi:  290nM ΔG°:  -8.82kcal/molepH: 7.4 T: 2°C. Assay description: Inhibition of human DPP-IV activity was measured under steady-state conditions by following the absorbance increase at 405 nm upon the substrate clea...
In DepthDetails ArticlePubMed