BDBM119245 US8673906, 3.05::US9718800, 3.05
SMILES CC(Nc1ccc(F)c(Cl)c1)c1cc(cc2c1oc(cc2=O)N1CCOCC1)C(=O)N(C)C
InChI Key InChIKey=ADQKWHMLZWYXPE-UHFFFAOYSA-N
Data  7 IC50
  Tab Delimited (TSV)   2D SDfile   Computed 3D by Vconf -m prep SDfile
Find this compound or compounds like it in BindingDB:
Activity Spreadsheet -- Enzyme Inhibition Constant Data from BindingDB
Found 7 hits for monomerid = 119245
LigandPNGBDBM119245(US8673906, 3.05 | US9718800, 3.05)
Affinity DataIC50:  6nM. Assay description: The inhibition of PI3Kβ, PI3Kα, PI3Kγ and PI3Kδ was evaluated in a Kinase Glo based enzyme activity assay using human recombinant...
In DepthDetails US Patent
LigandPNGBDBM119245(US8673906, 3.05 | US9718800, 3.05)
Affinity DataIC50:  1.80E+3nM. Assay description: Inhibition of human recombinant PI3Kgamma using PIP2 by Kinase-Glo Plus assay
In DepthDetails ArticlePubMed
LigandPNGBDBM119245(US8673906, 3.05 | US9718800, 3.05)
Affinity DataIC50:  64nM. Assay description: Inhibition of human recombinant PI3Kdelta using PIP2 by Kinase-Glo Plus assay
In DepthDetails ArticlePubMed
LigandPNGBDBM119245(US8673906, 3.05 | US9718800, 3.05)
Affinity DataIC50:  6nMT: 2°C. Assay description: Compounds in 100% DMSO were added to assay plates by acoustic dispensing. PI3Kβ was added in a Tris buffer (50 mM Tris pH7.4, 0.05% CHAPS, 2.1 m...
In DepthDetails US Patent
LigandPNGBDBM119245(US8673906, 3.05 | US9718800, 3.05)
Affinity DataIC50:  12nM. Assay description: Inhibition of human recombinant PI3Kbeta using PIP2 by Kinase-Glo Plus assay
In DepthDetails ArticlePubMed
LigandPNGBDBM119245(US8673906, 3.05 | US9718800, 3.05)
Affinity DataIC50:  170nM. Assay description: Inhibition of human recombinant PI3Kalpha using PIP2 by Kinase-Glo Plus assay
In DepthDetails ArticlePubMed
LigandPNGBDBM119245(US8673906, 3.05 | US9718800, 3.05)
Affinity DataIC50:  16nM. Assay description: Inhibition of PI3Kbeta in PTEN-null human MDA-MB-468 cells assessed as inhibition of Akt phosphorylation after 2 hrs
In DepthDetails ArticlePubMed