BDBM119261 US8673906, 3.21::US9718800, 3.21
SMILES CC(Nc1cc(ccc1C)C#N)c1cc(cc2c1oc(cc2=O)N1CCOCC1)C(=O)N(C)C
InChI Key InChIKey=UALFRJAIJVBSMZ-UHFFFAOYSA-N
Data  2 IC50
  Tab Delimited (TSV)   2D SDfile   Computed 3D by Vconf -m prep SDfile
Find this compound or compounds like it in BindingDB:
Activity Spreadsheet -- Enzyme Inhibition Constant Data from BindingDB
Found 2 hits for monomerid = 119261
LigandPNGBDBM119261(US8673906, 3.21 | US9718800, 3.21)
Affinity DataIC50:  114nMT: 2°C. Assay description: Compounds in 100% DMSO were added to assay plates by acoustic dispensing. PI3Kβ was added in a Tris buffer (50 mM Tris pH7.4, 0.05% CHAPS, 2.1 m...
In DepthDetails US Patent
LigandPNGBDBM119261(US8673906, 3.21 | US9718800, 3.21)
Affinity DataIC50:  114nM. Assay description: The inhibition of PI3Kβ, PI3Kα, PI3Kγ and PI3Kδ was evaluated in a Kinase Glo based enzyme activity assay using human recombinant...
In DepthDetails US Patent