BDBM119808 US8691852, 6
SMILES COc1cccc(c1)-c1cc(F)c(Nc2ncccc2C(O)=O)cc1F
InChI Key InChIKey=AAUOKRAJRPXVIO-UHFFFAOYSA-N
Data  2 IC50
  Tab Delimited (TSV)   2D SDfile   Computed 3D by Vconf -m prep SDfile
Find this compound or compounds like it in BindingDB:
Activity Spreadsheet -- Enzyme Inhibition Constant Data from BindingDB
Found 2 hits for monomerid = 119808
LigandPNGBDBM119808(US8691852, 6)
Affinity DataIC50:  88nM. Assay description: Inhibition of Homo sapiens (human) dehydroorotate dihydrogenase using 2,6-dichlorophenol-indophenol as substrate after 10 min by spectrophotometric a...
In DepthDetails Article
LigandPNGBDBM119808(US8691852, 6)
Affinity DataIC50:  88nMpH: 8.0Assay Description:DHODH activity and its inhibition were studied using a chromogen reduction assay with DCIP (2,6-dichlorophenol-indophenol). The substrate oxidation (...
In DepthDetails US Patent