BDBM119820 US8691852, 40
SMILES CCc1cnc(Nc2c(F)cc(cc2F)-c2cccc(OC)c2)c(c1)C(O)=O
InChI Key InChIKey=CKYAQBHJTNSQAU-UHFFFAOYSA-N
Data  2 IC50
  Tab Delimited (TSV)   2D SDfile   Computed 3D by Vconf -m prep SDfile
Find this compound or compounds like it in BindingDB:
Activity Spreadsheet -- Enzyme Inhibition Constant Data from BindingDB
Found 2 hits for monomerid = 119820
LigandPNGBDBM119820(US8691852, 40)
Affinity DataIC50:  12nM. Assay description: Inhibition of Homo sapiens (human) dehydroorotate dihydrogenase using 2,6-dichlorophenol-indophenol as substrate after 10 min by spectrophotometric a...
In DepthDetails Article
LigandPNGBDBM119820(US8691852, 40)
Affinity DataIC50:  12nMpH: 8.0Assay Description:DHODH activity and its inhibition were studied using a chromogen reduction assay with DCIP (2,6-dichlorophenol-indophenol). The substrate oxidation (...
In DepthDetails US Patent