BDBM119828 US8691852, 56
SMILES Cc1c(F)c(Nc2ncccc2C(O)=O)c(F)cc1-c1cccc(OC(F)(F)F)c1
InChI Key InChIKey=JLVQWSZSBVNIIE-UHFFFAOYSA-N
Data  2 IC50
  Tab Delimited (TSV)   2D SDfile   Computed 3D by Vconf -m prep SDfile
Find this compound or compounds like it in BindingDB:
Activity Spreadsheet -- Enzyme Inhibition Constant Data from BindingDB
Found 2 hits for monomerid = 119828
LigandPNGBDBM119828(US8691852, 56)
Affinity DataIC50:  6nM. Assay description: Inhibition of Homo sapiens (human) dehydroorotate dihydrogenase using 2,6-dichlorophenol-indophenol as substrate after 10 min by spectrophotometric a...
In DepthDetails Article
LigandPNGBDBM119828(US8691852, 56)
Affinity DataIC50:  6nMpH: 8.0Assay Description:DHODH activity and its inhibition were studied using a chromogen reduction assay with DCIP (2,6-dichlorophenol-indophenol). The substrate oxidation (...
In DepthDetails US Patent