BDBM119848 US8691986, 14
SMILES CNC(=O)c1ccc(cc1F)-c1nccnc1C1CN(C1)c1ccc2ncc(Cl)cc2n1
InChI Key InChIKey=IYDGGEUTAVPCGP-UHFFFAOYSA-N
Data  2 IC50
  Tab Delimited (TSV)   2D SDfile   Computed 3D by Vconf -m prep SDfile
Find this compound or compounds like it in BindingDB:
Activity Spreadsheet -- Enzyme Inhibition Constant Data from BindingDB
Found 2 hits for monomerid = 119848
TargetcGMP-dependent 3',5'-cyclic phosphodiesterase(Homo sapiens (Human))
Amgen
US Patent
LigandPNGBDBM119848(US8691986, 14)
Affinity DataIC50:  1.00E+4nMpH: 7.2 T: 2°C. Assay description: IMAP TR-FRET progressive binding system, FAM-cAMP substrate were from Molecular Devices (Sunnyvale, Calif.). The PDE IMAP assay was conducted in a 3...
In DepthDetails US Patent
TargetcAMP and cAMP-inhibited cGMP 3',5'-cyclic phosphodiesterase 10A(Homo sapiens (Human))
Amgen
US Patent
LigandPNGBDBM119848(US8691986, 14)
Affinity DataIC50:  3.60nMpH: 7.2 T: 2°C. Assay description: IMAP TR-FRET progressive binding system, FAM-cAMP substrate were from Molecular Devices (Sunnyvale, Calif.). The PDE IMAP assay was conducted in a 3...
In DepthDetails US Patent