BDBM119851 US8691986, 15::US9718803, 30.2
SMILES NC(=O)c1ccc(cc1)-c1nccnc1C1CN(C1)c1ccc2ccccc2n1
InChI Key InChIKey=PFAVUEZQRHCZTK-UHFFFAOYSA-N
Data  4 IC50
  Tab Delimited (TSV)   2D SDfile   Computed 3D by Vconf -m prep SDfile
Find this compound or compounds like it in BindingDB:
Activity Spreadsheet -- Enzyme Inhibition Constant Data from BindingDB
Found 4 hits for monomerid = 119851
TargetcAMP and cAMP-inhibited cGMP 3',5'-cyclic phosphodiesterase 10A(Homo sapiens (Human))
Amgen
US Patent
LigandPNGBDBM119851(US8691986, 15 | US9718803, 30.2)
Affinity DataIC50:  1.30nMpH: 7.2 T: 2°C. Assay description: IMAP TR-FRET progressive binding system, FAM-cAMP substrate were from Molecular Devices (Sunnyvale, Calif.). The PDE IMAP assay was conducted in a 3...
In DepthDetails US Patent
TargetcAMP and cAMP-inhibited cGMP 3',5'-cyclic phosphodiesterase 10A(Homo sapiens (Human))
Amgen
US Patent
LigandPNGBDBM119851(US8691986, 15 | US9718803, 30.2)
Affinity DataIC50:  1.30nMT: 2°C. Assay description: An IMAP TR-FRET assay was used to analyze the enzyme activity (Molecular Devices Corp., Sunnyvale Calif.). 5 L of serial diluted PDE10A (BPS Bioscien...
In DepthDetails US Patent
TargetcAMP and cAMP-inhibited cGMP 3',5'-cyclic phosphodiesterase 10A(Homo sapiens (Human))
Amgen
US Patent
LigandPNGBDBM119851(US8691986, 15 | US9718803, 30.2)
Affinity DataIC50:  1.30nMT: 2°C. Assay description: Enzyme Activity. An IMAP TR-FRET assay was used to analyze the enzyme activity (Molecular Devices Corp., Sunnyvale Calif.). 5 uL of serial diluted PD...
In DepthDetails US Patent
TargetcGMP-dependent 3',5'-cyclic phosphodiesterase(Homo sapiens (Human))
Amgen
US Patent
LigandPNGBDBM119851(US8691986, 15 | US9718803, 30.2)
Affinity DataIC50:  1.00E+4nMpH: 7.2 T: 2°C. Assay description: IMAP TR-FRET progressive binding system, FAM-cAMP substrate were from Molecular Devices (Sunnyvale, Calif.). The PDE IMAP assay was conducted in a 3...
In DepthDetails US Patent