BDBM119960 US8697911, 123
SMILES CN1CCc2ccc(NC(=O)c3cccc(CNC(=O)c4nnn(-c5nonc5N)c4-c4ccccc4)c3)cc2C1
InChI Key InChIKey=KSSUCEGOJKECCV-UHFFFAOYSA-N
Data  2 IC50
  Tab Delimited (TSV)   2D SDfile   Computed 3D by Vconf -m prep SDfile
Find this compound or compounds like it in BindingDB:
Activity Spreadsheet -- Enzyme Inhibition Constant Data from BindingDB
Found 2 hits for monomerid = 119960
TargetRho-associated protein kinase 2(Homo sapiens (Human))
Boehringer Ingelheim International
US Patent
LigandPNGBDBM119960(US8697911, 123)
Affinity DataIC50:  3.90nMpH: 7.2Assay Description:This assay is performed using FAM S6 substrate peptide (Catalogue #R7184) and IMAP FP Screening Express Kit detection reagents from Molecular Devices...
In DepthDetails US Patent
TargetRho-associated protein kinase 2(Homo sapiens (Human))
Boehringer Ingelheim International
US Patent
LigandPNGBDBM119960(US8697911, 123)
Affinity DataIC50:  1.70nMpH: 7.5 T: 2°C. Assay description: The activity of ROCKII (1-543) kinase is measured utilizing Cambrex PKLight ATP Detection Reagent, a homogeneous assay technology using luciferin-luc...
In DepthDetails US Patent