BDBM119976 US8697911, 146
SMILES O=C(NCc1cccc(c1)C(=O)Nc1nc2CC[C@@H](Cc2s1)N1CCOCC1)c1csc(n1)-c1cccnc1
InChI Key InChIKey=SVAQNYXFGPPYCL-NRFANRHFSA-N
Data  1 IC50
  Tab Delimited (TSV)   2D SDfile   Computed 3D by Vconf -m prep SDfile
Find this compound or compounds like it in BindingDB:
Activity Spreadsheet -- Enzyme Inhibition Constant Data from BindingDB
Found 1 hit for monomerid = 119976
TargetRho-associated protein kinase 2(Homo sapiens (Human))
Boehringer Ingelheim International
US Patent
LigandPNGBDBM119976(US8697911, 146)
Affinity DataIC50:  0.730nMpH: 7.2Assay Description:This assay is performed using FAM S6 substrate peptide (Catalogue #R7184) and IMAP FP Screening Express Kit detection reagents from Molecular Devices...
In DepthDetails US Patent