BDBM120041 US8697869, 34
SMILES COCCN([C@H]1CCc2c(C1)c1cc(F)ccc1n2CC(O)=O)c1ncc(Cl)cn1
InChI Key InChIKey=VDOHIOCTBLQCOZ-HNNXBMFYSA-N
Data  1 IC50
  Tab Delimited (TSV)   2D SDfile   Computed 3D by Vconf -m prep SDfile
Find this compound or compounds like it in BindingDB:
Activity Spreadsheet -- Enzyme Inhibition Constant Data from BindingDB
Found 1 hit for monomerid = 120041
TargetProstaglandin D2 receptor 2(Homo sapiens (Human))
Actelion Pharmaceuticals
US Patent
LigandPNGBDBM120041(US8697869, 34)
Affinity DataIC50:  5.90nMpH: 7.0Assay Description:Binding assay was performed in a final assay volume of 250 μl. First, 25 μl of test compound, previously diluted in Binding-Buffer (Binding...
In DepthDetails US Patent