BDBM120222 US8691753, 71
SMILES OC(=O)CC[C@H](NC(=O)CCc1ccc(cc1)-c1ccc(cc1)-c1ccccc1)C(=O)Nc1cccc(CC(O)=O)c1
InChI Key InChIKey=OUZMHHWAGJCAFA-PMERELPUSA-N
Data  8 KI
  Tab Delimited (TSV)   2D SDfile   Computed 3D by Vconf -m prep SDfile
Find this compound or compounds like it in BindingDB:
Activity Spreadsheet -- Enzyme Inhibition Constant Data from BindingDB
Found 8 hits for monomerid = 120222
TargetMacrophage metalloelastase(Homo sapiens (Human))
Commissariat A L'Energie Atomique Et Aux Energies Alternatives
US Patent
LigandPNGBDBM120222(US8691753, 71)
Affinity DataKi:  1.05nM. Assay description: The inhibition tests and the evaluation of the inhibition constants (Ki) on the various MMPs were carried out as described by Devel et al. (Devel et ...
In DepthDetails US Patent
TargetStromelysin-2(Homo sapiens (Human))
Commissariat A L'Energie Atomique Et Aux Energies Alternatives
US Patent
LigandPNGBDBM120222(US8691753, 71)
Affinity DataKi:  7.70nM. Assay description: The inhibition tests and the evaluation of the inhibition constants (Ki) on the various MMPs were carried out as described by Devel et al. (Devel et ...
In DepthDetails US Patent
TargetCollagenase 3(Homo sapiens (Human))
Commissariat A L'Energie Atomique Et Aux Energies Alternatives
US Patent
LigandPNGBDBM120222(US8691753, 71)
Affinity DataKi:  10.2nM. Assay description: The inhibition tests and the evaluation of the inhibition constants (Ki) on the various MMPs were carried out as described by Devel et al. (Devel et ...
In DepthDetails US Patent
Target72 kDa type IV collagenase(Homo sapiens (Human))
Commissariat A L'Energie Atomique Et Aux Energies Alternatives
US Patent
LigandPNGBDBM120222(US8691753, 71)
Affinity DataKi:  18.1nM. Assay description: The inhibition tests and the evaluation of the inhibition constants (Ki) on the various MMPs were carried out as described by Devel et al. (Devel et ...
In DepthDetails US Patent
TargetStromelysin-1(Homo sapiens (Human))
Commissariat A L'Energie Atomique Et Aux Energies Alternatives
US Patent
LigandPNGBDBM120222(US8691753, 71)
Affinity DataKi:  34nM. Assay description: The inhibition tests and the evaluation of the inhibition constants (Ki) on the various MMPs were carried out as described by Devel et al. (Devel et ...
In DepthDetails US Patent
TargetNeutrophil collagenase(Homo sapiens (Human))
Commissariat A L'Energie Atomique Et Aux Energies Alternatives
US Patent
LigandPNGBDBM120222(US8691753, 71)
Affinity DataKi:  99nM. Assay description: The inhibition tests and the evaluation of the inhibition constants (Ki) on the various MMPs were carried out as described by Devel et al. (Devel et ...
In DepthDetails US Patent
TargetMatrix metalloproteinase-9(Homo sapiens (Human))
Commissariat A L'Energie Atomique Et Aux Energies Alternatives
US Patent
LigandPNGBDBM120222(US8691753, 71)
Affinity DataKi:  645nM. Assay description: The inhibition tests and the evaluation of the inhibition constants (Ki) on the various MMPs were carried out as described by Devel et al. (Devel et ...
In DepthDetails US Patent
TargetMatrix metalloproteinase-14 [1-20,P8S](Homo sapiens (Human))
Commissariat A L'Energie Atomique Et Aux Energies Alternatives
US Patent
LigandPNGBDBM120222(US8691753, 71)
Affinity DataKi:  696nM. Assay description: The inhibition tests and the evaluation of the inhibition constants (Ki) on the various MMPs were carried out as described by Devel et al. (Devel et ...
In DepthDetails US Patent