BDBM120758 US8703761, 6-14
SMILES CC(C)(NC(=O)c1cncs1)C(=O)Nc1nc(c(Oc2ccc(F)cc2)s1)-c1ccc(F)cc1
InChI Key InChIKey=YFXJJJRQYVSADL-UHFFFAOYSA-N
Data  1 IC50
  Tab Delimited (TSV)   2D SDfile   Computed 3D by Vconf -m prep SDfile
Find this compound or compounds like it in BindingDB:
Activity Spreadsheet -- Enzyme Inhibition Constant Data from BindingDB
Found 1 hit for monomerid = 120758
TargetDiacylglycerol O-acyltransferase 1 [89-488](Homo sapiens (Human))
Novartis
US Patent
LigandPNGBDBM120758(US8703761, 6-14)
Affinity DataIC50:  197nMpH: 7.5 T: 2°C. Assay description: The enzyme preparation used in this assay is a membrane preparation from Sf9 cells overexpressing human (His)6DGAT1. During all steps samples were ch...
In DepthDetails US Patent