BDBM120761 US8703761, 12-3
SMILES CC(C)(NC(=O)C1(C)CC1)C(=O)Nc1nc(c(s1)C(=O)c1ccc(F)cc1)C(F)(F)F
InChI Key InChIKey=RBNFMENBOMXIOK-UHFFFAOYSA-N
Data  1 IC50
  Tab Delimited (TSV)   2D SDfile   Computed 3D by Vconf -m prep SDfile
Find this compound or compounds like it in BindingDB:
Activity Spreadsheet -- Enzyme Inhibition Constant Data from BindingDB
Found 1 hit for monomerid = 120761
TargetDiacylglycerol O-acyltransferase 1 [89-488](Homo sapiens (Human))
Novartis
US Patent
LigandPNGBDBM120761(US8703761, 12-3)
Affinity DataIC50:  1.18E+3nMpH: 7.5 T: 2°C. Assay description: The enzyme preparation used in this assay is a membrane preparation from Sf9 cells overexpressing human (His)6DGAT1. During all steps samples were ch...
In DepthDetails US Patent