BDBM120883 US8716287, 16
SMILES COc1ccccc1CNCCc1ccc(NC(=O)Nc2cnc(cn2)C#N)cc1Cl
InChI Key InChIKey=JWGHJLYEWMUDIB-UHFFFAOYSA-N
Data  1 IC50
  Tab Delimited (TSV)   2D SDfile   Computed 3D by Vconf -m prep SDfile
Find this compound or compounds like it in BindingDB:
Activity Spreadsheet -- Enzyme Inhibition Constant Data from BindingDB
Found 1 hit for monomerid = 120883
TargetSerine/threonine-protein kinase Chk1(Homo sapiens (Human))
Sentinel Oncology
US Patent
LigandPNGBDBM120883(US8716287, 16)
Affinity DataIC50:  13nMpH: 7.5Assay Description:The compounds of the invention were tested for activity against Chk-1 kinase using the materials and protocols set out below. Reaction Buffer: Base R...
In DepthDetails US Patent