BDBM121033 US8722896, 3-(Benzyl(methyl)amino)-N-(9- chloro-3,4-dihydro-2H-1,5- benzodioxepin-7-ylmethyl)-N- isobutylpropanamide
SMILES CC(C)CN(Cc1cc(Cl)c2OCCCOc2c1)C(=O)CCN(C)Cc1ccccc1
InChI Key InChIKey=FFWMIHFPJXWRSN-UHFFFAOYSA-N
Data  1 KI
  Tab Delimited (TSV)   2D SDfile   Computed 3D by Vconf -m prep SDfile
Find this compound or compounds like it in BindingDB:
Activity Spreadsheet -- Enzyme Inhibition Constant Data from BindingDB
Found 1 hit for monomerid = 121033
TargetProkineticin receptor 2(Cricetulus griseus (Chinese hamster))
The Regents Of The University Of California
US Patent
LigandPNGBDBM121033(US8722896, 3-(Benzyl(methyl)amino)-N-(9- chloro-3,...)
Affinity DataKi:  272nM ΔG°:  -9.31kcal/moleT: 2°C. Assay description: An aequorin-based luminescent assay for calcium mobilization was used to measure mobilization of intracellular Ca2+ (Bullock et al., Mol Pharmacol 65...
In DepthDetails US Patent