BDBM121452 US8722709, 56
SMILES NC(=O)Nc1cc(ccn1)C1=C(CCCC1)c1ccc(F)cc1
InChI Key InChIKey=IDZIQEQJVCRWQF-UHFFFAOYSA-N
Data  1 IC50
  Tab Delimited (TSV)   2D SDfile   Computed 3D by Vconf -m prep SDfile
Find this compound or compounds like it in BindingDB:
Activity Spreadsheet -- Enzyme Inhibition Constant Data from BindingDB
Found 1 hit for monomerid = 121452
TargetMineralocorticoid receptor(Homo sapiens (Human))
Boehringer Ingelheim International
US Patent
LigandPNGBDBM121452(US8722709, 56)
Affinity DataIC50:  140nMpH: 7.4Assay Description:The MR competitive binding assay is based on the binding and displacement of a TAMRA-labeled Dexamethasone probe with fluorescence polarization (FP) ...
Ligand InfoPC cidPC sid
In DepthDetails US Patent