BDBM121453 US8722709, 57
SMILES NC(=O)Nc1cc(ccn1)C1CCCCC1c1ccc(F)cc1
InChI Key InChIKey=LKJVPQQHOPZTPA-UHFFFAOYSA-N
Data  1 IC50
  Tab Delimited (TSV)   2D SDfile   Computed 3D by Vconf -m prep SDfile
Find this compound or compounds like it in BindingDB:
Activity Spreadsheet -- Enzyme Inhibition Constant Data from BindingDB
Found 1 hit for monomerid = 121453
TargetMineralocorticoid receptor(Homo sapiens (Human))
Boehringer Ingelheim International
US Patent
LigandPNGBDBM121453(US8722709, 57)
Affinity DataIC50:  270nMpH: 7.4Assay Description:The MR competitive binding assay is based on the binding and displacement of a TAMRA-labeled Dexamethasone probe with fluorescence polarization (FP) ...
In DepthDetails US Patent