BDBM12233 AZD0530 analogue 11::N-(2H-1,3-benzodioxol-4-yl)-5-(oxan-4-yloxy)-7-[3-(pyrrolidin-1-yl)propoxy]quinazolin-4-amine::N-1,3-Benzodioxol-4-yl-7-(3-pyrrolidin-1-ylpropoxy)-5-(tetrahydro-2H-pyran-4-yloxy)quinazolin-4-amine
SMILES C(COc1cc(OC2CCOCC2)c2c(Nc3cccc4OCOc34)ncnc2c1)CN1CCCC1
InChI Key InChIKey=IWGJMDXPSOGADO-UHFFFAOYSA-N
Data  2 IC50
  Tab Delimited (TSV)   2D SDfile   Computed 3D by Vconf -m prep SDfile
Find this compound or compounds like it in BindingDB:
Activity Spreadsheet -- Enzyme Inhibition Constant Data from BindingDB
Found 2 hits for monomerid = 12233
TargetVascular endothelial growth factor receptor 2(Homo sapiens (Human))
Astrazeneca
LigandPNGBDBM12233(AZD0530 analogue 11 | N-(2H-1,3-benzodioxol-4-yl)-...)
Affinity DataIC50:  100nM. Assay description: An ELISA assay was used to determine the ability of inhibitor to inhibit VEGF-R RTK activity. The compounds were incubated with enzyme 20 min at room...
In DepthDetails ArticlePubMed
TargetProto-oncogene tyrosine-protein kinase Src(Homo sapiens (Human))
Astrazeneca
LigandPNGBDBM12233(AZD0530 analogue 11 | N-(2H-1,3-benzodioxol-4-yl)-...)
Affinity DataIC50:  40nMpH: 7.4 T: 2°C. Assay description: This assay determines the ability of test compounds to inhibit Src kinase activity that catalyzes the transfer of the terminal phosphate to the immob...
In DepthDetails ArticlePubMed