BDBM12248 AZD0530 analogue 26::N-(5-chloro-2H-1,3-benzodioxol-4-yl)-5-[(1-methylpiperidin-4-yl)methoxy]quinazolin-4-amine
SMILES CN1CCC(COc2cccc3ncnc(Nc4c5OCOc5ccc4Cl)c23)CC1
InChI Key InChIKey=UDVNZNDYOYKJHC-UHFFFAOYSA-N
Data  1 IC50
  Tab Delimited (TSV)   2D SDfile   Computed 3D by Vconf -m prep SDfile
Find this compound or compounds like it in BindingDB:
Activity Spreadsheet -- Enzyme Inhibition Constant Data from BindingDB
Found 1 hit for monomerid = 12248
TargetProto-oncogene tyrosine-protein kinase Src(Homo sapiens (Human))
Astrazeneca
LigandPNGBDBM12248(AZD0530 analogue 26 | N-(5-chloro-2H-1,3-benzodiox...)
Affinity DataIC50:  500nM. Assay description: This assay determines the ability of test compounds to inhibit Src kinase activity that catalyzes the transfer of the terminal phosphate to the immob...
In DepthDetails ArticlePubMed