BDBM123017 US8742138, 2
SMILES OC(=O)CNC(=O)c1c2cc(ccc2c(O)oc1=O)-c1ccccc1Cl
InChI Key InChIKey=MLIKFCLMFRVLLB-UHFFFAOYSA-N
Data  1 IC50
  Tab Delimited (TSV)   2D SDfile   Computed 3D by Vconf -m prep SDfile
Find this compound or compounds like it in BindingDB:
Activity Spreadsheet -- Enzyme Inhibition Constant Data from BindingDB
Found 1 hit for monomerid = 123017
TargetEgl nine homolog 1(Rattus norvegicus (Rat))
Betta Pharmaceuticals
US Patent
LigandPNGBDBM123017(US8742138, 2)
Affinity DataIC50:  150nMT: 2°C. Assay description: HIF-PHD2 activity was measured using homogeneous TR-FRET technology (see also, US2008/004817; Dao J H et al., Anal Biochem. 2009, 384:213-23). To eac...
In DepthDetails US Patent