BDBM123025 US8742138, 10
SMILES OC(=O)CNC(=O)c1c2cc(ccc2c(O)oc1=O)-c1ccc(F)c(F)c1
InChI Key InChIKey=QVTJZCLNDKHRRZ-UHFFFAOYSA-N
Data  1 IC50
  Tab Delimited (TSV)   2D SDfile   Computed 3D by Vconf -m prep SDfile
Find this compound or compounds like it in BindingDB:
Activity Spreadsheet -- Enzyme Inhibition Constant Data from BindingDB
Found 1 hit for monomerid = 123025
TargetEgl nine homolog 1(Rattus norvegicus (Rat))
Betta Pharmaceuticals
US Patent
LigandPNGBDBM123025(US8742138, 10)
Affinity DataIC50:  150nMT: 2°C. Assay description: HIF-PHD2 activity was measured using homogeneous TR-FRET technology (see also, US2008/004817; Dao J H et al., Anal Biochem. 2009, 384:213-23). To eac...
In DepthDetails US Patent