BDBM123131 US8742113, 15
SMILES CCOC(=O)C1C(=O)C(OC1=Nc1ccccc1Cl)=Cc1c[nH]c2ncccc12
InChI Key InChIKey=HMWBVXRIMOMPSB-YRPBBKCRSA-N
Data  1 IC50
  Tab Delimited (TSV)   2D SDfile   Computed 3D by Vconf -m prep SDfile
Find this compound or compounds like it in BindingDB:
Activity Spreadsheet -- Enzyme Inhibition Constant Data from BindingDB
Found 1 hit for monomerid = 123131
TargetCell division cycle 7-related protein kinase(Homo sapiens (Human))
Sbi Biotech
US Patent
LigandPNGBDBM123131(US8742113, 15)
Affinity DataIC50:  2nMpH: 7.5Assay Description:Measurement of kinase activity was carried out using an MSA assay kit (QuickScout Screening Assist Kit, Carna Biosciences, Inc.). Assay buffer (20 mM...
In DepthDetails US Patent