BDBM12332 5-[(1E)-{[2-(dimethylamino)ethoxy]imino}methyl]-6-[(4-fluoro-2-methyl-1H-indol-5-yl)oxy]pyrimidin-4-amine::oxime analog 21
SMILES CN(C)CCO\N=C\c1c(N)ncnc1Oc1ccc2[nH]c(C)cc2c1F
InChI Key InChIKey=DNDRALHDYQVCAG-NUGSKGIGSA-N
Data  1 IC50
  Tab Delimited (TSV)   2D SDfile   Computed 3D by Vconf -m prep SDfile
Find this compound or compounds like it in BindingDB:
Activity Spreadsheet -- Enzyme Inhibition Constant Data from BindingDB
Found 1 hit for monomerid = 12332
TargetVascular endothelial growth factor receptor 2(Rattus norvegicus (rat))
Johnson & Johnson Pharmaceutical
LigandPNGBDBM12332(5-[(1E)-{[2-(dimethylamino)ethoxy]imino}methyl]-6-...)
Affinity DataIC50:  187nMpH: 8.0 T: 2°C. Assay description: The enzyme was assayed with a biotinylated peptide substrate and test compounds in the presence of 5 uM ATP/[gamma-33P]ATP in a streptavidin coated F...
In DepthDetails ArticlePubMed