BDBM123379 US8742106, 6.22
SMILES COc1ccc(cn1)C(C)NC(=O)COc1cc(C(F)F)c2c(nn(C)c2n1)-c1ccccc1
InChI Key InChIKey=XUCPLVDEFHBGNJ-UHFFFAOYSA-N
Data  2 Kd
  Tab Delimited (TSV)   2D SDfile   Computed 3D by Vconf -m prep SDfile
Find this compound or compounds like it in BindingDB:
Activity Spreadsheet -- Enzyme Inhibition Constant Data from BindingDB
Found 2 hits for monomerid = 123379
TargetOrexin/Hypocretin receptor type 1(Homo sapiens (Human))
Novartis
US Patent
LigandPNGBDBM123379(US8742106, 6.22)
Affinity DataKd:  56nMpH: 7.5 T: 2°C. Assay description: For crude cell membrane preparations, cells (CHO, Chinese hamster ovary or HEK, human embryonic kidney) expressing human orexin 1 or human orexin 2 r...
In DepthDetails US Patent
TargetOrexin receptor type 2(Homo sapiens (Human))
Novartis
US Patent
LigandPNGBDBM123379(US8742106, 6.22)
Affinity DataKd:  42nMpH: 7.5 T: 2°C. Assay description: For crude cell membrane preparations, cells (CHO, Chinese hamster ovary or HEK, human embryonic kidney) expressing human orexin 1 or human orexin 2 r...
In DepthDetails US Patent