BDBM123466 US8741923, 39
SMILES Cc1ccccc1-c1ccc(cc1C(F)(F)F)-c1nc(no1)-c1ccc2CCN(CCC(O)=O)Cc2c1
InChI Key InChIKey=XEYJYFKBXVADGE-UHFFFAOYSA-N
Data  1 KI
  Tab Delimited (TSV)   2D SDfile   Computed 3D by Vconf -m prep SDfile
Find this compound or compounds like it in BindingDB:
Activity Spreadsheet -- Enzyme Inhibition Constant Data from BindingDB
Found 1 hit for monomerid = 123466
TargetSphingosine 1-phosphate receptor 1(Homo sapiens (Human))
Merck Serono
US Patent
LigandPNGBDBM123466(US8741923, 39)
Affinity DataKi:  0.600nM ΔG°:  -11.7kcal/molepH: 7.4 T: 2°C. Assay description: Receptor binding assay: Membranes were prepared from CHO cells expressing S1P1 or S1P3 for use in ligand and 35S-GTPγS binding studies. Cells we...
In DepthDetails US Patent