BDBM123504 US8748435, 29
SMILES CCc1nn2c(C)cc(C)nc2c1Cc1ccc(cc1)-n1cc(CN2CC(N)C2)cn1
InChI Key InChIKey=IXWBQHXFJSGVJN-UHFFFAOYSA-N
Data  1 IC50
  Tab Delimited (TSV)   2D SDfile   Computed 3D by Vconf -m prep SDfile
Find this compound or compounds like it in BindingDB:
Activity Spreadsheet -- Enzyme Inhibition Constant Data from BindingDB
Found 1 hit for monomerid = 123504
TargetG-protein coupled receptor 4(Homo sapiens (Human))
Novartis
US Patent
LigandPNGBDBM123504(US8748435, 29)
Affinity DataIC50:  21nMpH: 8.0Assay Description:Serial dilutions of compounds (stock in 10 mM DMSO) are prepared by first diluting the compounds in DMSO followed by a 1:50 dilution into assay buffe...
In DepthDetails US Patent