BDBM123536 US8748624, 22
SMILES Cc1cc(Cl)ccc1-c1ccc(NCc2ccc(cc2-c2ccc(nc2)C(=O)NCCC(O)=O)C(F)(F)F)cc1
InChI Key InChIKey=PABOOOGTAXELOR-UHFFFAOYSA-N
Data  1 KI
  Tab Delimited (TSV)   2D SDfile   Computed 3D by Vconf -m prep SDfile
Find this compound or compounds like it in BindingDB:
Activity Spreadsheet -- Enzyme Inhibition Constant Data from BindingDB
Found 1 hit for monomerid = 123536
TargetGlucagon receptor(Homo sapiens (Human))
Janssen Pharmaceutica
US Patent
LigandPNGBDBM123536(US8748624, 22)
Affinity DataKi:  25.2nMpH: 7.4Assay Description:The binding assay was performed by a filtration method in a 384 well format. Membranes at a final protein concentration of 6 μg/well were incuba...
In DepthDetails US Patent