BDBM12381 1-[5-(5-Chloro-thiophen-2-yl)-isoxazol-3-ylmethyl]-5-nitro-1H-indole-2-carboxylic acid (1-isopropyl-piperidin-4-yl)-amide::1-{[5-(5-chlorothiophen-2-yl)-1,2-oxazol-3-yl]methyl}-5-nitro-N-[1-(propan-2-yl)piperidin-4-yl]-1H-indole-2-carboxamide::2-Carboxyindole Scaffold 32
SMILES CC(C)N1CCC(CC1)NC(=O)c1cc2cc(ccc2n1Cc1cc(on1)-c1ccc(Cl)s1)[N+]([O-])=O
InChI Key InChIKey=IGEMJMNVYQORGC-UHFFFAOYSA-N
Data  1 KI
  Tab Delimited (TSV)   2D SDfile   Computed 3D by Vconf -m prep SDfile
Find this compound or compounds like it in BindingDB:
Activity Spreadsheet -- Enzyme Inhibition Constant Data from BindingDB
Found 1 hit for monomerid = 12381
TargetCoagulation factor X(Homo sapiens (Human))
Aventis Pharma
LigandPNGBDBM12381(1-[5-(5-Chloro-thiophen-2-yl)-isoxazol-3-ylmethyl]...)
Affinity DataKi:  1nM ΔG°:  -12.3kcal/molepH: 7.8 T: 2°C. Assay description: The inhibitory effect of test compound for human fXa was determined by using the chromogenic substrates S-2765. The hydrolysis rates of chromogenic s...
In DepthDetails ArticlePubMed