BDBM12383 2-Carboxyindole Scaffold 34::6-Chloro-1-[5-(5-chloro-thiophen-2-yl)-isoxazol-3-ylmethyl]-1H-indole-2-carboxylic acid (1-isopropyl-piperidin-4-yl)-amide::6-chloro-1-{[5-(5-chlorothiophen-2-yl)-1,2-oxazol-3-yl]methyl}-N-[1-(propan-2-yl)piperidin-4-yl]-1H-indole-2-carboxamide
SMILES CC(C)N1CCC(CC1)NC(=O)c1cc2ccc(Cl)cc2n1Cc1cc(on1)-c1ccc(Cl)s1
InChI Key InChIKey=ZLQITWMSLIPBGT-UHFFFAOYSA-N
Data  1 KI
  Tab Delimited (TSV)   2D SDfile   Computed 3D by Vconf -m prep SDfile
Find this compound or compounds like it in BindingDB:
Activity Spreadsheet -- Enzyme Inhibition Constant Data from BindingDB
Found 1 hit for monomerid = 12383
TargetCoagulation factor X(Homo sapiens (Human))
Aventis Pharma
LigandPNGBDBM12383(2-Carboxyindole Scaffold 34 | 6-Chloro-1-[5-(5-chl...)
Affinity DataKi:  7nM ΔG°:  -11.1kcal/molepH: 7.8 T: 2°C. Assay description: The inhibitory effect of test compound for human fXa was determined by using the chromogenic substrates S-2765. The hydrolysis rates of chromogenic s...
In DepthDetails ArticlePubMed