BDBM123923 US8754233, (4-Benzothiazol-2-yl-1H-pyrazol-3-yl)-[2-(1H-imidazol-4-yl)-ethyl]-amine
SMILES C(Cc1cnc[nH]1)Nc1[nH]ncc1-c1nc2ccccc2s1
InChI Key InChIKey=SKFIGKZRFZMUKR-UHFFFAOYSA-N
Data  1 IC50
  Tab Delimited (TSV)   2D SDfile   Computed 3D by Vconf -m prep SDfile
Find this compound or compounds like it in BindingDB:
Activity Spreadsheet -- Enzyme Inhibition Constant Data from BindingDB
Found 1 hit for monomerid = 123923
TargetIntegrin-linked protein kinase(Homo sapiens (Human))
Dermira (Canada)
US Patent
LigandPNGBDBM123923(US8754233, (4-Benzothiazol-2-yl-1H-pyrazol-3-yl)-[...)
Affinity DataIC50:  200nMT: 2°C. Assay description: 5 uL of each compound dilution were robotically pipetted to Costar serocluster plates maintaining the same plate layout. All assay mixtures consisted...
In DepthDetails US Patent