BDBM12420 9.7b::Fluoro-Olefin Analogue 2::N-Benzyl-2-cyclopentylidene-2-fluoroethanamine::benzyl(2-cyclopentylidene-2-fluoroethyl)amine
SMILES F\[#6](-[#6]-[#7]-[#6]-c1ccccc1)=[#6]-1/[#6]-[#6]-[#6]-[#6]-1
InChI Key InChIKey=RPGPEMGRBZGBFA-UHFFFAOYSA-N
Data  2 IC50
  Tab Delimited (TSV)   2D SDfile   Computed 3D by Vconf -m prep SDfile
Find this compound or compounds like it in BindingDB:
Activity Spreadsheet -- Enzyme Inhibition Constant Data from BindingDB
Found 2 hits for monomerid = 12420
TargetDipeptidyl peptidase 2(Homo sapiens (Human))
University Of Antwerp
LigandPNGBDBM12420(9.7b | Fluoro-Olefin Analogue 2 | N-Benzyl-2-cyclo...)
Affinity DataIC50:  3.78E+4nM. Assay description: The DPP inhibition was measured by monitoring the cleavage of chromogenic substrate in the presence of each inhibitor compound. IC50 value was determ...
In DepthDetails ArticlePubMed
TargetDipeptidyl peptidase 4(Homo sapiens (Human))
University Of Antwerp
LigandPNGBDBM12420(9.7b | Fluoro-Olefin Analogue 2 | N-Benzyl-2-cyclo...)
Affinity DataIC50: >1.00E+6nMpH: 8.3 T: 2°C. Assay description: The DPP inhibition was measured by monitoring the cleavage of chromogenic substrate in the presence of each inhibitor compound. IC50 value was determ...
In DepthDetails ArticlePubMed