BDBM124216 ({7-[2-({7-[(aminosulfinyl)difluoromethyl]-6-bromonaphthalen-2-yl}methyl)-2-(1H-1,2,3-benzotriazol-1-yl)-3-oxo-3-phenylpropyl]-3-bromonaphthalen-2-yl}difluoromethyl)phosphonic acid (10j)
SMILES NS(=O)C(F)(F)c1cc2cc(CC(Cc3ccc4cc(Br)c(cc4c3)C(F)(F)P(O)(O)=O)(C(=O)c3ccccc3)n3nnc4ccccc34)ccc2cc1Br
InChI Key InChIKey=XZBONGJVYMLTQL-UHFFFAOYSA-N
Data  2 IC50
  Tab Delimited (TSV)   2D SDfile   Computed 3D by Vconf -m prep SDfile
Find this compound or compounds like it in BindingDB:
Activity Spreadsheet -- Enzyme Inhibition Constant Data from BindingDB
Found 2 hits for monomerid = 124216
TargetTyrosine-protein phosphatase non-receptor type 2(Homo sapiens (Human))
Zydus Research Centre
LigandPNGBDBM124216(({7-[2-({7-[(aminosulfinyl)difluoromethyl]-6-bromo...)
Affinity DataIC50:  480nM. Assay description: The in vitro enzyme inhibitory activity was evaluated by using the pNPP assay. Para-nitrophenylphosphate (pNPP) and test compounds were added to assa...
In DepthDetails ArticlePubMed
TargetTyrosine-protein phosphatase non-receptor type 1(Homo sapiens (Human))
Zydus Research Centre
LigandPNGBDBM124216(({7-[2-({7-[(aminosulfinyl)difluoromethyl]-6-bromo...)
Affinity DataIC50:  4nM. Assay description: The in vitro enzyme inhibitory activity was evaluated by using the pNPP assay. Para-nitrophenylphosphate (pNPP) and test compounds were added to assa...
In DepthDetails ArticlePubMed