BDBM124814 US8759386, 11
SMILES Cc1nn(Cc2ccc(NC(=O)c3cc4ccc(F)cc4[nH]3)cc2)c(C)c1CC(O)=O
InChI Key InChIKey=ZNCJOUXHHGBJQU-UHFFFAOYSA-N
Data  1 KI
  Tab Delimited (TSV)   2D SDfile   Computed 3D by Vconf -m prep SDfile
Find this compound or compounds like it in BindingDB:
Activity Spreadsheet -- Enzyme Inhibition Constant Data from BindingDB
Found 1 hit for monomerid = 124814
TargetProstaglandin D2 receptor 2(Homo sapiens (Human))
Boehringer Ingelheim International
US Patent
LigandPNGBDBM124814(US8759386, 11)
Affinity DataKi:  0.200nM ΔG°:  -13.2kcal/molepH: 7.4 T: 2°C. Assay description: The CRTH2 receptor binding assay is performed in a scintillation proximity assay (SPA) format with the radioligand [3H]-PGD2 (Perkin Elmer, NET616000...
In DepthDetails US Patent