BDBM12484 (2S)-({N-[3-({[(7R,9S,12S)-12-cyclohexyl-11,14-dioxo-2-oxa-6-thia-10,13-diazatricyclo[14.3.1.17,10]henicosa-1(20),16,18-trien-9-yl]carbonyl}amino)-2-oxohexanoyl]glycyl}amino)(phenyl)acetic acid N,N-dimethyl amide::3-{[(7R,9S,12S)-12-cyclohexyl-11,14-dioxo-2-oxa-6-thia-10,13-diazatricyclo[14.3.1.1^{7,10}]henicosa-1(20),16,18-trien-9-yl]formamido}-N-({[(S)-(dimethylcarbamoyl)(phenyl)methyl]carbamoyl}methyl)-2-oxohexanamide::Proline-Based Macrocycle 35
SMILES CCCC(NC(=O)[C@@H]1C[C@@H]2CN1C(=O)[C@@H](NC(=O)Cc1cccc(OCCCS2)c1)C1CCCCC1)C(=O)C(=O)NCC(=O)N[C@H](C(=O)N(C)C)c1ccccc1
InChI Key InChIKey=STDKCAAAVGRJPO-MTFMWLKXSA-N
Data  1 KI
  Tab Delimited (TSV)   2D SDfile   Computed 3D by Vconf -m prep SDfile
Find this compound or compounds like it in BindingDB:
Activity Spreadsheet -- Enzyme Inhibition Constant Data from BindingDB
Found 1 hit for monomerid = 12484
TargetGenome polyprotein(Hepatitis C virus (HCV genotype 1a, isolate H))
Schering-Plough Research Institute
LigandPNGBDBM12484((2S)-({N-[3-({[(7R,9S,12S)-12-cyclohexyl-11,14-dio...)
Affinity DataKi:  10nM ΔG°:  -11.1kcal/molepH: 6.5 T: 2°C. Assay description: Proteolytic cleavage of the ester linkage between the Nva (L-norvaline) and the chromophore (PAP) was monitored for change in absorbance at 370 nm. I...
In DepthDetails ArticlePubMed