BDBM125052 US8772511, 21::US9714242, 21
SMILES O=C(Nc1ccccc1)Nc1cccc2cc(sc12)C(=O)N[C@H]1CN2CCC1CC2
InChI Key InChIKey=VOEZCTHQVJCHAX-IBGZPJMESA-N
Data  3 KI
  Tab Delimited (TSV)   2D SDfile   Computed 3D by Vconf -m prep SDfile
Find this compound or compounds like it in BindingDB:
Activity Spreadsheet -- Enzyme Inhibition Constant Data from BindingDB
Found 3 hits for monomerid = 125052
TargetNeuronal acetylcholine receptor subunit alpha-7(Rattus norvegicus (Rat))
Bayer Intellectual Property
US Patent
LigandPNGBDBM125052(US8772511, 21 | US9714242, 21)
Affinity DataKi:  4.30nM ΔG°:  -10.6kcal/molepH: 7.4 T: 2°C. Assay description: Rat brain tissue (hippocampus or whole brain) is homogenized in aqueous homogenization buffer (10% w/v, 0.32 M sucrose, 1 mM EDTA, 0.1 mM phenylmethy...
In DepthDetails US Patent
TargetNeuronal acetylcholine receptor subunit alpha-7(Rattus norvegicus (Rat))
Bayer Intellectual Property
US Patent
LigandPNGBDBM125052(US8772511, 21 | US9714242, 21)
Affinity DataKi:  15nMpH: 7.4Assay Description:The [3H]-methyllycaconitine binding assay is a modification of the method described by Davies et al. in Neuropharmacol, 1999, 38, 679-690.Rat brain t...
In DepthDetails US Patent
Target5-hydroxytryptamine receptor 3A(Homo sapiens (Human))
Bayer Intellectual Property
US Patent
LigandPNGBDBM125052(US8772511, 21 | US9714242, 21)
Affinity DataKi:  1.60E+3nMpH: 7.4Assay Description:Membranes from HEK293 cells which express recombinant human 5-HT3 receptor (RB-HS3, Receptor Biology, Inc., MD, USA) are diluted in accordance with t...
In DepthDetails US Patent