BDBM125569 US8772316, 52
SMILES CCCNc1nc2ccc(OC)cc2cc1Cc1c2cc(OC)c(OC)cc2c(CCC)[nH]c1=O
InChI Key InChIKey=PLYWPPNPPNLKNV-UHFFFAOYSA-N
Data  1 IC50
  Tab Delimited (TSV)   2D SDfile   Computed 3D by Vconf -m prep SDfile
Find this compound or compounds like it in BindingDB:
Activity Spreadsheet -- Enzyme Inhibition Constant Data from BindingDB
Found 1 hit for monomerid = 125569
TargetcAMP and cAMP-inhibited cGMP 3',5'-cyclic phosphodiesterase 10A(Homo sapiens (Human))
Allergan
US Patent
LigandPNGBDBM125569(US8772316, 52)
Affinity DataIC50:  1.5nMpH: 7.4Assay Description:The PDE assay is based on the homogenous time-resolved fluorescence resonance energy transfer (TR-FRET) technology (LANCE from Perkin Elmer). This co...
In DepthDetails US Patent